{"text_format":"1","workbook":"xlsx","n_sheets":8,"sheets":["(1)&(2)","(3) Imports","FormData","RawData","Facility","Ports","Destinations","AllProductData"],"not_rendered":{"charts":0,"images":2,"macros":1,"external_links":1,"defined_names":5,"comments":0,"pivot_tables":0},"unopened":[],"bounds":{"document_bytes":16777216,"sheet_cells":100000,"rows_first":2000,"rows_last":500,"rows_between":2000,"halvings":0,"cell_chars":16384,"cell_head_chars":4096},"cells_cut":0,"cells_raw":0,"read":"whole","date_system":"1900"}

{"sheet":"(1)&(2)","index":0,"n_rows":69,"n_cols":53,"rows_kept":69,"cut":false,"hidden":false,"merged":[[67,26,67,29],[57,0,62,49],[45,8,45,20],[51,12,51,13],[36,8,36,20],[40,5,40,8],[67,2,67,11],[53,8,53,20],[51,17,51,18],[67,14,67,24],[47,16,47,17],[47,5,47,8],[49,7,49,20],[40,16,40,17],[2,0,2,7],[12,25,13,49],[10,0,11,49],[24,1,26,22],[5,44,5,49],[16,6,16,20],[18,18,18,19],[18,27,20,48],[20,18,20,19],[6,41,6,49],[38,8,38,20],[9,0,9,49],[24,27,25,48],[8,0,8,49],[7,40,7,49],[12,0,13,24],[31,27,32,48]]}
[null,null,null,null,null,null,null,null,null,null,null,null,null,null,null,null,null,null,null,null,null,null,null,null,null,null,null,null,null,null,null,null,null,null,null,null,null,null,null,null,null,null,null,null,null,null,null,null,null,null,null,"Raw Data"]
[null,null,null,null,null,null,null,null,null,null,null,null,null,null,null,null,null,null,null,null,null,null,null,null,null,null,null,null,null,null,null,null,null,null,null,null,null,null,null,null,null,null,null,null,null,null,null,null,null,null,null,"Resubmission?",{"$f":"'(3) Imports'!J28","v":"N"}]
[null,null,null,null,null,null,null,null,null,null,null,null,null,null,null,null,null,null,null,null,null,null,null,null,null,null,null,null,null,null,null,null,null,null,null,null,null,null,null,null,null,null,null,null,null,null,null,null,null,null,null,"Company Name",{"$f":"G17","v":0}]
[null,null,null,null,null,null,null,null,null,null,null,null,null,null,null,null,null,null,null,null,null,null,null,null,null,null,null,null,null,null,null,null,null,null,null,null,null,null,null,null,null,null,null,null,null,null,null,null,null,null,null,"Rpt Pd",{"$f":"CONCATENATE(S19,O19)","v":""}]
[null,null,null,null,null,null,null,null,null,null,null,null,null,null,null,null,null,null,null,null,null,null,null,null,null,null,null,null,null,null,null,null,null,null,null,null,null,null,null,null,null,null,null,null,null,null,null,null,null,null,null,"Rpt Date",{"$f":"CONCATENATE(K21,\"/\",O21,\"/\",S21)","v":"//"}]
[null,null,null,null,null,null,null,null,null,null,null,null,null,null,null,null,null,null,null,null,null,null,null,null,null,null,null,null,null,null,null,null,null,null,null,null,null,null,null,null,null,null,null,null,"Phone: (808) 587-3807 ",null,null,null,null,null,null,"ID No",{"$f":"#REF!","v":{"$error":"#REF!"}}]
[null,null,null,null,null,null,null,null,null,null,null,null,null,null,null,null,null,null,null,null,null,null,null,null,null,null,null,null,null,null,null,null,null,null,null,null,null,null,null,null,null,"Email: dbedt.hseo.eiirp@hawaii.gov",null,null,null,null,null,null,null,null,null,"Info changed?"]
[null,null,null,null,null,null,null,null,null,null,null,null,null,null,null,null,null,null,null,null,null,null,null,null,null,null,null,null,null,null,null,null,null,null,null,null,null,null,null,null,"https://energy.hawaii.gov/eiirp",null,null,null,null,null,null,null,null,null,null,"Distributor",false]
["Form DBEDT-110",null,null,null,null,null,null,null,null,null,null,null,null,null,null,null,null,null,null,null,null,null,null,null,null,null,null,null,null,null,null,null,null,null,null,null,null,null,null,null,null,null,null,null,null,null,null,null,null,null,null,"Refiner"]
["MONTHLY PETROLEUM IMPORTS REPORT",null,null,null,null,null,null,null,null,null,null,null,null,null,null,null,null,null,null,null,null,null,null,null,null,null,null,null,null,null,null,null,null,null,null,null,null,null,null,null,null,null,null,null,null,null,null,null,null,null,null,"Facility Location",{"$f":"I37","v":0}]
{"$rows_left_out":60}
{"sheet":"(3) Imports","index":1,"n_rows":99,"n_cols":46,"rows_kept":99,"cut":false,"hidden":false,"merged":[[0,0,1,45],[10,0,10,45],[11,0,11,45],[12,0,12,45],[13,0,14,45],[9,36,9,45],[49,1,49,12],[50,1,50,12],[32,26,32,31],[33,26,33,31],[33,32,33,36],[32,15,32,22],[33,24,33,25],[34,26,34,31],[36,32,36,36],[45,32,45,36],[35,15,35,22],[33,15,33,22],[32,24,32,25],[33,1,33,12],[45,15,45,22],[42,15,42,22],[37,15,37,22],[44,15,44,22],[88,12,88,16],[86,12,86,16],[36,24,36,25],[35,24,35,25],[34,24,34,25],[81,1,81,12],[62,1,62,12],[63,1,63,12],[65,1,65,12],[79,1,79,12],[80,1,80,12],[71,1,71,12],[53,1,53,12],[54,1,54,12],[55,1,55,12],[45,1,45,12],[46,1,46,12],[47,1,47,12],[48,1,48,12],[82,1,82,12],[59,1,59,12],[60,1,60,12],[57,1,57,12],[44,1,44,12],[38,15,38,22],[81,24,81,25],[80,24,80,25],[61,1,61,12],[56,1,56,12],[34,1,34,12],[35,1,35,12],[36,1,36,12],[34,15,34,22],[42,1,42,12],[43,1,43,12],[41,15,41,22],[60,24,60,25],[59,24,59,25],[57,15,57,22],[41,24,41,25],[40,24,40,25],[51,15,51,22],[37,1,37,12],[40,15,40,22],[43,15,43,22],[80,15,80,22],[52,1,52,12],[58,1,58,12],[78,32,78,36],[62,26,62,31],[62,32,62,36],[49,32,49,36],[63,24,63,25],[80,26,80,31],[56,24,56,25],[81,26,81,31],[62,24,62,25],[61,24,61,25],[52,32,52,36],[53,26,53,31],[50,32,50,36],[55,24,55,25],[55,32,55,36],[51,32,51,36],[53,32,53,36],[56,32,56,36],[57,32,57,36],[63,32,63,36],[65,32,65,36],[80,32,80,36],[60,32,60,36],[59,32,59,36],[59,15,59,22],[81,15,81,22],[82,15,82,22],[77,1,77,12],[62,15,62,22],[52,15,52,22],[53,15,53,22],[56,15,56,22],[54,26,54,31],[82,24,82,25],[65,24,65,25],[57,26,57,31],[65,26,65,31],[57,24,57,25],[58,24,58,25],[56,26,56,31],[64,1,64,12],[64,15,64,22],[64,24,64,25],[64,26,64,31],[68,32,68,36],[73,26,73,31],[73,32,73,36],[72,26,72,31],[72,32,72,36],[75,26,75,31],[59,26,59,31],[69,26,69,31],[69,32,69,36],[68,26,68,31],[64,32,64,36],[79,32,79,36],[83,32,83,36],[83,24,83,25],[83,26,83,31],[77,15,77,22],[68,24,68,25],[69,24,69,25],[73,24,73,25],[70,24,70,25],[74,24,74,25],[72,24,72,25],[69,15,69,22],[71,24,71,25],[75,24,75,25],[75,32,75,36],[76,24,76,25],[82,32,82,36],[77,26,77,31],[77,32,77,36],[79,26,79,31],[82,26,82,31],[81,32,81,36],[71,26,71,31],[71,32,71,36],[43,26,43,31],[38,26,38,31],[39,26,39,31],[42,26,42,31],[39,32,39,36],[43,32,43,36],[42,32,42,36],[37,24,37,25],[40,26,40,31],[4,0,4,7],[17,0,17,8],[22,0,22,8],[24,0,24,8],[27,0,27,8],[16,17,16,19],[16,15,16,16],[25,0,25,8],[30,0,31,0],[22,9,22,19],[21,0,21,8],[21,9,21,19],[20,0,20,8],[20,9,20,19],[18,9,18,19],[18,0,18,8],[26,0,26,8],[26,9,26,19],[19,0,19,8],[19,9,19,19],[23,0,23,8],[23,9,23,19],[29,37,29,40],[29,41,29,45],[16,24,16,25],[17,9,17,19],[32,32,32,36],[35,32,35,36],[46,26,46,31],[44,26,44,31],[41,32,41,36],[40,32,40,36],[34,32,34,36],[37,26,37,31],[35,26,35,31],[41,26,41,31],[45,26,45,31],[36,26,36,31],[42,24,42,25],[38,24,38,25],[43,24,43,25],[45,24,45,25],[44,24,44,25],[39,15,39,22],[37,32,37,36],[38,32,38,36],[47,26,47,31],[44,32,44,36],[70,26,70,31],[70,32,70,36],[74,26,74,31],[47,32,47,36],[46,32,46,36],[76,26,76,31],[76,32,76,36],[74,32,74,36],[51,26,51,31],[52,26,52,31],[55,26,55,31],[60,26,60,31],[61,32,61,36],[58,26,58,31],[63,26,63,31],[61,26,61,31],[48,26,48,31],[49,26,49,31],[50,26,50,31],[54,32,54,36],[48,32,48,36],[58,32,58,36],[36,15,36,22],[55,15,55,22],[65,15,65,22],[79,15,79,22],[39,24,39,25],[54,24,54,25],[77,24,77,25],[79,24,79,25],[46,24,46,25],[47,15,47,22],[51,24,51,25],[54,15,54,22],[50,24,50,25],[48,24,48,25],[52,24,52,25],[63,15,63,22],[58,15,58,22],[49,24,49,25],[48,15,48,22],[50,15,50,22],[49,15,49,22],[61,15,61,22],[46,15,46,22],[60,15,60,22],[7,39,7,45],[8,37,8,45],[51,1,51,12],[41,1,41,12],[24,9,24,19],[25,9,25,19],[27,9,27,19],[67,24,67,25],[67,26,67,31],[67,32,67,36],[31,37,31,40],[31,26,31,31],[31,41,31,45],[31,15,31,22],[31,32,31,36],[30,37,30,40],[30,41,30,45],[30,1,31,12],[30,14,31,14],[30,15,30,22],[30,26,30,31],[30,32,30,36],[53,24,53,25],[47,24,47,25],[83,1,83,12],[83,15,83,22],[38,1,38,12],[39,1,39,12],[40,1,40,12],[32,1,32,12],[69,1,69,12],[67,1,67,12],[67,15,67,22],[71,15,71,22],[68,1,68,12],[68,15,68,22],[73,1,73,12],[73,15,73,22],[70,1,70,12],[70,15,70,22],[74,1,74,12],[74,15,74,22],[72,1,72,12],[72,15,72,22],[75,1,75,12],[75,15,75,22],[76,1,76,12],[76,15,76,22]]}
["Part 3. Import Activity Detail"]
[]
[]
[]
[]
[]
[]
[null,null,null,null,null,null,null,null,null,null,null,null,null,null,null,null,null,null,null,null,null,null,null,null,null,null,null,null,null,null,null,null,null,null,null,null,null,null,null,"Phone: (808) 587-3807"]
[null,null,null,null,null,null,null,null,null,null,null,null,null,null,null,null,null,null,null,null,null,null,null,null,null,null,null,null,null,null,null,null,null,null,null,null,null,"Email: dbedt.hseo.eiirp@hawaii.gov"]
[null,null,null,null,null,null,null,null,null,null,null,null,null,null,null,null,null,null,null,null,null,null,null,null,null,null,null,null,null,null,null,null,null,null,null,null,"https://energy.hawaii.gov/eiirp"]
{"$rows_left_out":90}
{"sheet":"FormData","index":2,"n_rows":2,"n_cols":16,"rows_kept":2,"cut":false,"hidden":true,"merged":[]}
["form_code","dbedt","company_code","asset_id","facility_code","island_code","report_date","report_period","report_period_month","report_period_year","resubmission","total_products_reported","total_barrels_reported","total_receipts","total_distribution","total_inventory"]
[{"$f":"'(3) Imports'!J21","v":""},110,{"$f":"'(3) Imports'!J20","v":""},{"$f":"_xlfn.IFNA(VLOOKUP('(3) Imports'!J22,Facility!$A$2:$H$35,7, FALSE), \"\" )","v":""},{"$f":"_xlfn.IFNA(VLOOKUP('(3) Imports'!J22,Facility!$A$2:$H$35,8, FALSE), \"\" )","v":""},{"$f":"'(3) Imports'!J24","v":""},{"$f":"'(3) Imports'!J25","v":"//"},{"$f":"'(3) Imports'!J27","v":""},{"$f":"'(1)&(2)'!O19","v":0},{"$f":"'(1)&(2)'!S19","v":0},{"$f":"Facility!B74","v":false},{"$f":"'(3) Imports'!M87","v":0},{"$f":"'(3) Imports'!M89","v":0}]

{"sheet":"RawData","index":3,"n_rows":2,"n_cols":9,"rows_kept":2,"cut":false,"hidden":true,"merged":[]}
["form_code","product","product_code","port_entry","port_code","origin","volume_import","sulfur_weight","api_gravity"]
[{"$f":"_xlfn._xlws.SORT(_xlfn.UNIQUE(AllProductData!A2:I51,FALSE,FALSE),1,-1,FALSE)","v":""},"","","","","","","",""]

{"sheet":"Facility","index":4,"n_rows":74,"n_cols":8,"rows_kept":74,"cut":false,"hidden":true,"merged":[]}
["Facility Name","Facility Street Address","City","State","Zip","Island","Facility Code","Code"]
["Aloha Hilo Terminal","999 Kalanianaole Avenue","Hilo","HI","96720","Hawaii","TM_013","001"]
["Aloha Hilo Terminal 2","661 Kalanianaole Avenue","Hilo","HI","96720","Hawaii","TM_014","002"]
["Aloha Honolulu Terminal","789 North Nimitz Highway","Honolulu","HI","96817","O'ahu","TM_006","003"]
["Aloha Kahului Terminal","60 Hobron Avenue","Kahului","HI","96732","Maui","TM_015","004"]
["Aloha Nawiliwili Terminal","3145 Waapa Road","Lihue","HI","96766","Kaua'i","TM_016","005"]
["Aloha TFM Kalaeloa Terminal","91-119 Hanua Street","Kapolei","HI","96707","O'ahu","TM_010","006"]
["Hawaii Gas Barbers Point","91-571 Malakole St ","Kapolei","HI","96707","O'ahu","TM_011","007"]
["Hawaii Gas Hilo Base Yard","945 Kalanianaole Ave","Hilo","HI","96720","Hawaii","TM_017","008"]
["Hawaii Gas Kauai Base Yard","3000 Waapa Road","Lihue","HI","96766","Kaua'i","TM_018","009"]
{"$rows_left_out":65}
{"sheet":"Ports","index":5,"n_rows":11,"n_cols":5,"rows_kept":11,"cut":false,"hidden":true,"merged":[]}
["Ports","Zone","Code","Full Name","Asset_ID"]
["Kalaeloa Barbers Point","1","BAR","Kalaeloa Barbers Point Harbor, Oahu","PT_001"]
["Hilo","7","HIL","Hilo Harbor, Hawaii","PT_005"]
["Honolulu","1","HNL","Honolulu Harbor, Oahu","PT_004"]
["Kahului","3","KAH","Kahului Harbor, Maui","PT_006"]
["Kaunakakai","5","KAK","Kaunakakai Harbor, Molokai","PT_008"]
["Kaumalapau","6","KAU","Kaumalapau Harbor, Lanai","PT_007"]
["Kawaihae","8","KAW","Kawaihae Harbor, Hawaii","PT_009"]
["Kewalo Basin","1","KWB","Kewalo Basin, Oahu","PT_010"]
["Nawiliwili","2","NAW","Nawiliwili Harbor, Kauai","PT_011"]
{"$rows_left_out":2}
{"sheet":"Destinations","index":6,"n_rows":245,"n_cols":1,"rows_kept":245,"cut":false,"hidden":true,"merged":[]}
["Destinations"]
["Afghanistan"]
["Albania"]
["Algeria"]
["Andorra"]
["Angola"]
["Antigua and Barbuda"]
["Argentina"]
["Armenia"]
["Austria"]
{"$rows_left_out":236}
{"sheet":"AllProductData","index":7,"n_rows":51,"n_cols":9,"rows_kept":51,"cut":false,"hidden":true,"merged":[]}
["form_code","product","product_code","port_entry","port_code","origin","volume_import","sulfur_weight","api_gravity"]
[{"$f":"IF(AND(D2=\"\",E2=\"\",F2=\"\",G2=\"\",H2=\"\",I2=\"\"),\"\",'(3) Imports'!$J$21)","v":""},{"$f":"IF(AND(D2=\"\",E2=\"\",F2=\"\",G2=\"\",H2=\"\",I2=\"\"),\"\",'(3) Imports'!B33)","v":""},{"$f":"IF(AND(D2=\"\",E2=\"\",F2=\"\",G2=\"\",H2=\"\",I2=\"\"),\"\",'(3) Imports'!O33)","v":""},{"$f":"IF(ISBLANK('(3) Imports'!P33),\"\",LOOKUP('(3) Imports'!P33,Ports!$A$2:$A$11,Ports!$C$2:$C$11))","v":""},{"$f":"IF(ISBLANK('(3) Imports'!P33),\"\",LOOKUP('(3) Imports'!P33,Ports!$A$2:$A$11,Ports!$E$2:$E$11))","v":""},{"$f":"IF('(3) Imports'!AA33>0,'(3) Imports'!AA33,\"\")","v":""},{"$f":"IF('(3) Imports'!AG33>0,'(3) Imports'!AG33,\"\")","v":""},{"$f":"IF(AND(ISBLANK('(3) Imports'!AL33),ISBLANK('(3) Imports'!AN33),ISBLANK('(3) Imports'!AO33)),\"\",CONCATENATE('(3) Imports'!AL33,'(3) Imports'!AM33,'(3) Imports'!AN33,'(3) Imports'!AO33))","v":""},{"$f":"IF(AND(ISBLANK('(3) Imports'!AP33),ISBLANK('(3) Imports'!AQ33),ISBLANK('(3) Imports'!AS33),ISBLANK('(3) Imports'!AT33)),\"\",CONCATENATE('(3) Imports'!AP33,'(3) Imports'!AQ33,'(3) Imports'!AR33,'(3) Imports'!AS33,'(3) Imports'!AT33))","v":""}]
[{"$f":"IF(AND(D3=\"\",E3=\"\",F3=\"\",G3=\"\",H3=\"\",I3=\"\"),\"\",'(3) Imports'!$J$21)","v":""},{"$f":"IF(AND(D3=\"\",E3=\"\",F3=\"\",G3=\"\",H3=\"\",I3=\"\"),\"\",'(3) Imports'!B34)","v":""},{"$f":"IF(AND(D3=\"\",E3=\"\",F3=\"\",G3=\"\",H3=\"\",I3=\"\"),\"\",'(3) Imports'!O34)","v":""},{"$f":"IF(ISBLANK('(3) Imports'!P34),\"\",LOOKUP('(3) Imports'!P34,Ports!$A$2:$A$11,Ports!$C$2:$C$11))","v":""},{"$f":"IF(ISBLANK('(3) Imports'!P34),\"\",LOOKUP('(3) Imports'!P34,Ports!$A$2:$A$11,Ports!$E$2:$E$11))","v":""},{"$f":"IF('(3) Imports'!AA34>0,'(3) Imports'!AA34,\"\")","v":""},{"$f":"IF('(3) Imports'!AG34>0,'(3) Imports'!AG34,\"\")","v":""},{"$f":"IF(AND(ISBLANK('(3) Imports'!AL34),ISBLANK('(3) Imports'!AN34),ISBLANK('(3) Imports'!AO34)),\"\",CONCATENATE('(3) Imports'!AL34,'(3) Imports'!AM34,'(3) Imports'!AN34,'(3) Imports'!AO34))","v":""},{"$f":"IF(AND(ISBLANK('(3) Imports'!AP34),ISBLANK('(3) Imports'!AQ34),ISBLANK('(3) Imports'!AS34),ISBLANK('(3) Imports'!AT34)),\"\",CONCATENATE('(3) Imports'!AP34,'(3) Imports'!AQ34,'(3) Imports'!AR34,'(3) Imports'!AS34,'(3) Imports'!AT34))","v":""}]
[{"$f":"IF(AND(D4=\"\",E4=\"\",F4=\"\",G4=\"\",H4=\"\",I4=\"\"),\"\",'(3) Imports'!$J$21)","v":""},{"$f":"IF(AND(D4=\"\",E4=\"\",F4=\"\",G4=\"\",H4=\"\",I4=\"\"),\"\",'(3) Imports'!B35)","v":""},{"$f":"IF(AND(D4=\"\",E4=\"\",F4=\"\",G4=\"\",H4=\"\",I4=\"\"),\"\",'(3) Imports'!O35)","v":""},{"$f":"IF(ISBLANK('(3) Imports'!P35),\"\",LOOKUP('(3) Imports'!P35,Ports!$A$2:$A$11,Ports!$C$2:$C$11))","v":""},{"$f":"IF(ISBLANK('(3) Imports'!P35),\"\",LOOKUP('(3) Imports'!P35,Ports!$A$2:$A$11,Ports!$E$2:$E$11))","v":""},{"$f":"IF('(3) Imports'!AA35>0,'(3) Imports'!AA35,\"\")","v":""},{"$f":"IF('(3) Imports'!AG35>0,'(3) Imports'!AG35,\"\")","v":""},{"$f":"IF(AND(ISBLANK('(3) Imports'!AL35),ISBLANK('(3) Imports'!AN35),ISBLANK('(3) Imports'!AO35)),\"\",CONCATENATE('(3) Imports'!AL35,'(3) Imports'!AM35,'(3) Imports'!AN35,'(3) Imports'!AO35))","v":""},{"$f":"IF(AND(ISBLANK('(3) Imports'!AP35),ISBLANK('(3) Imports'!AQ35),ISBLANK('(3) Imports'!AS35),ISBLANK('(3) Imports'!AT35)),\"\",CONCATENATE('(3) Imports'!AP35,'(3) Imports'!AQ35,'(3) Imports'!AR35,'(3) Imports'!AS35,'(3) Imports'!AT35))","v":""}]
[{"$f":"IF(AND(D5=\"\",E5=\"\",F5=\"\",G5=\"\",H5=\"\",I5=\"\"),\"\",'(3) Imports'!$J$21)","v":""},{"$f":"IF(AND(D5=\"\",E5=\"\",F5=\"\",G5=\"\",H5=\"\",I5=\"\"),\"\",'(3) Imports'!B36)","v":""},{"$f":"IF(AND(D5=\"\",E5=\"\",F5=\"\",G5=\"\",H5=\"\",I5=\"\"),\"\",'(3) Imports'!O36)","v":""},{"$f":"IF(ISBLANK('(3) Imports'!P36),\"\",LOOKUP('(3) Imports'!P36,Ports!$A$2:$A$11,Ports!$C$2:$C$11))","v":""},{"$f":"IF(ISBLANK('(3) Imports'!P36),\"\",LOOKUP('(3) Imports'!P36,Ports!$A$2:$A$11,Ports!$E$2:$E$11))","v":""},{"$f":"IF('(3) Imports'!AA36>0,'(3) Imports'!AA36,\"\")","v":""},{"$f":"IF('(3) Imports'!AG36>0,'(3) Imports'!AG36,\"\")","v":""},{"$f":"IF(AND(ISBLANK('(3) Imports'!AL36),ISBLANK('(3) Imports'!AN36),ISBLANK('(3) Imports'!AO36)),\"\",CONCATENATE('(3) Imports'!AL36,'(3) Imports'!AM36,'(3) Imports'!AN36,'(3) Imports'!AO36))","v":""},{"$f":"IF(AND(ISBLANK('(3) Imports'!AP36),ISBLANK('(3) Imports'!AQ36),ISBLANK('(3) Imports'!AS36),ISBLANK('(3) Imports'!AT36)),\"\",CONCATENATE('(3) Imports'!AP36,'(3) Imports'!AQ36,'(3) Imports'!AR36,'(3) Imports'!AS36,'(3) Imports'!AT36))","v":""}]
[{"$f":"IF(AND(D6=\"\",E6=\"\",F6=\"\",G6=\"\",H6=\"\",I6=\"\"),\"\",'(3) Imports'!$J$21)","v":""},{"$f":"IF(AND(D6=\"\",E6=\"\",F6=\"\",G6=\"\",H6=\"\",I6=\"\"),\"\",'(3) Imports'!B37)","v":""},{"$f":"IF(AND(D6=\"\",E6=\"\",F6=\"\",G6=\"\",H6=\"\",I6=\"\"),\"\",'(3) Imports'!O37)","v":""},{"$f":"IF(ISBLANK('(3) Imports'!P37),\"\",LOOKUP('(3) Imports'!P37,Ports!$A$2:$A$11,Ports!$C$2:$C$11))","v":""},{"$f":"IF(ISBLANK('(3) Imports'!P37),\"\",LOOKUP('(3) Imports'!P37,Ports!$A$2:$A$11,Ports!$E$2:$E$11))","v":""},{"$f":"IF('(3) Imports'!AA37>0,'(3) Imports'!AA37,\"\")","v":""},{"$f":"IF('(3) Imports'!AG37>0,'(3) Imports'!AG37,\"\")","v":""},{"$f":"IF(AND(ISBLANK('(3) Imports'!AL37),ISBLANK('(3) Imports'!AN37),ISBLANK('(3) Imports'!AO37)),\"\",CONCATENATE('(3) Imports'!AL37,'(3) Imports'!AM37,'(3) Imports'!AN37,'(3) Imports'!AO37))","v":""},{"$f":"IF(AND(ISBLANK('(3) Imports'!AP37),ISBLANK('(3) Imports'!AQ37),ISBLANK('(3) Imports'!AS37),ISBLANK('(3) Imports'!AT37)),\"\",CONCATENATE('(3) Imports'!AP37,'(3) Imports'!AQ37,'(3) Imports'!AR37,'(3) Imports'!AS37,'(3) Imports'!AT37))","v":""}]
[{"$f":"IF(AND(D7=\"\",E7=\"\",F7=\"\",G7=\"\",H7=\"\",I7=\"\"),\"\",'(3) Imports'!$J$21)","v":""},{"$f":"IF(AND(D7=\"\",E7=\"\",F7=\"\",G7=\"\",H7=\"\",I7=\"\"),\"\",'(3) Imports'!B38)","v":""},{"$f":"IF(AND(D7=\"\",E7=\"\",F7=\"\",G7=\"\",H7=\"\",I7=\"\"),\"\",'(3) Imports'!O38)","v":""},{"$f":"IF(ISBLANK('(3) Imports'!P38),\"\",LOOKUP('(3) Imports'!P38,Ports!$A$2:$A$11,Ports!$C$2:$C$11))","v":""},{"$f":"IF(ISBLANK('(3) Imports'!P38),\"\",LOOKUP('(3) Imports'!P38,Ports!$A$2:$A$11,Ports!$E$2:$E$11))","v":""},{"$f":"IF('(3) Imports'!AA38>0,'(3) Imports'!AA38,\"\")","v":""},{"$f":"IF('(3) Imports'!AG38>0,'(3) Imports'!AG38,\"\")","v":""},{"$f":"IF(AND(ISBLANK('(3) Imports'!AL38),ISBLANK('(3) Imports'!AN38),ISBLANK('(3) Imports'!AO38)),\"\",CONCATENATE('(3) Imports'!AL38,'(3) Imports'!AM38,'(3) Imports'!AN38,'(3) Imports'!AO38))","v":""},{"$f":"IF(AND(ISBLANK('(3) Imports'!AP38),ISBLANK('(3) Imports'!AQ38),ISBLANK('(3) Imports'!AS38),ISBLANK('(3) Imports'!AT38)),\"\",CONCATENATE('(3) Imports'!AP38,'(3) Imports'!AQ38,'(3) Imports'!AR38,'(3) Imports'!AS38,'(3) Imports'!AT38))","v":""}]
[{"$f":"IF(AND(D8=\"\",E8=\"\",F8=\"\",G8=\"\",H8=\"\",I8=\"\"),\"\",'(3) Imports'!$J$21)","v":""},{"$f":"IF(AND(D8=\"\",E8=\"\",F8=\"\",G8=\"\",H8=\"\",I8=\"\"),\"\",'(3) Imports'!B39)","v":""},{"$f":"IF(AND(D8=\"\",E8=\"\",F8=\"\",G8=\"\",H8=\"\",I8=\"\"),\"\",'(3) Imports'!O39)","v":""},{"$f":"IF(ISBLANK('(3) Imports'!P39),\"\",LOOKUP('(3) Imports'!P39,Ports!$A$2:$A$11,Ports!$C$2:$C$11))","v":""},{"$f":"IF(ISBLANK('(3) Imports'!P39),\"\",LOOKUP('(3) Imports'!P39,Ports!$A$2:$A$11,Ports!$E$2:$E$11))","v":""},{"$f":"IF('(3) Imports'!AA39>0,'(3) Imports'!AA39,\"\")","v":""},{"$f":"IF('(3) Imports'!AG39>0,'(3) Imports'!AG39,\"\")","v":""},{"$f":"IF(AND(ISBLANK('(3) Imports'!AL39),ISBLANK('(3) Imports'!AN39),ISBLANK('(3) Imports'!AO39)),\"\",CONCATENATE('(3) Imports'!AL39,'(3) Imports'!AM39,'(3) Imports'!AN39,'(3) Imports'!AO39))","v":""},{"$f":"IF(AND(ISBLANK('(3) Imports'!AP39),ISBLANK('(3) Imports'!AQ39),ISBLANK('(3) Imports'!AS39),ISBLANK('(3) Imports'!AT39)),\"\",CONCATENATE('(3) Imports'!AP39,'(3) Imports'!AQ39,'(3) Imports'!AR39,'(3) Imports'!AS39,'(3) Imports'!AT39))","v":""}]
[{"$f":"IF(AND(D9=\"\",E9=\"\",F9=\"\",G9=\"\",H9=\"\",I9=\"\"),\"\",'(3) Imports'!$J$21)","v":""},{"$f":"IF(AND(D9=\"\",E9=\"\",F9=\"\",G9=\"\",H9=\"\",I9=\"\"),\"\",'(3) Imports'!B40)","v":""},{"$f":"IF(AND(D9=\"\",E9=\"\",F9=\"\",G9=\"\",H9=\"\",I9=\"\"),\"\",'(3) Imports'!O40)","v":""},{"$f":"IF(ISBLANK('(3) Imports'!P40),\"\",LOOKUP('(3) Imports'!P40,Ports!$A$2:$A$11,Ports!$C$2:$C$11))","v":""},{"$f":"IF(ISBLANK('(3) Imports'!P40),\"\",LOOKUP('(3) Imports'!P40,Ports!$A$2:$A$11,Ports!$E$2:$E$11))","v":""},{"$f":"IF('(3) Imports'!AA40>0,'(3) Imports'!AA40,\"\")","v":""},{"$f":"IF('(3) Imports'!AG40>0,'(3) Imports'!AG40,\"\")","v":""},{"$f":"IF(AND(ISBLANK('(3) Imports'!AL40),ISBLANK('(3) Imports'!AN40),ISBLANK('(3) Imports'!AO40)),\"\",CONCATENATE('(3) Imports'!AL40,'(3) Imports'!AM40,'(3) Imports'!AN40,'(3) Imports'!AO40))","v":""},{"$f":"IF(AND(ISBLANK('(3) Imports'!AP40),ISBLANK('(3) Imports'!AQ40),ISBLANK('(3) Imports'!AS40),ISBLANK('(3) Imports'!AT40)),\"\",CONCATENATE('(3) Imports'!AP40,'(3) Imports'!AQ40,'(3) Imports'!AR40,'(3) Imports'!AS40,'(3) Imports'!AT40))","v":""}]
[{"$f":"IF(AND(D10=\"\",E10=\"\",F10=\"\",G10=\"\",H10=\"\",I10=\"\"),\"\",'(3) Imports'!$J$21)","v":""},{"$f":"IF(AND(D10=\"\",E10=\"\",F10=\"\",G10=\"\",H10=\"\",I10=\"\"),\"\",'(3) Imports'!B41)","v":""},{"$f":"IF(AND(D10=\"\",E10=\"\",F10=\"\",G10=\"\",H10=\"\",I10=\"\"),\"\",'(3) Imports'!O41)","v":""},{"$f":"IF(ISBLANK('(3) Imports'!P41),\"\",LOOKUP('(3) Imports'!P41,Ports!$A$2:$A$11,Ports!$C$2:$C$11))","v":""},{"$f":"IF(ISBLANK('(3) Imports'!P41),\"\",LOOKUP('(3) Imports'!P41,Ports!$A$2:$A$11,Ports!$E$2:$E$11))","v":""},{"$f":"IF('(3) Imports'!AA41>0,'(3) Imports'!AA41,\"\")","v":""},{"$f":"IF('(3) Imports'!AG41>0,'(3) Imports'!AG41,\"\")","v":""},{"$f":"IF(AND(ISBLANK('(3) Imports'!AL41),ISBLANK('(3) Imports'!AN41),ISBLANK('(3) Imports'!AO41)),\"\",CONCATENATE('(3) Imports'!AL41,'(3) Imports'!AM41,'(3) Imports'!AN41,'(3) Imports'!AO41))","v":""},{"$f":"IF(AND(ISBLANK('(3) Imports'!AP41),ISBLANK('(3) Imports'!AQ41),ISBLANK('(3) Imports'!AS41),ISBLANK('(3) Imports'!AT41)),\"\",CONCATENATE('(3) Imports'!AP41,'(3) Imports'!AQ41,'(3) Imports'!AR41,'(3) Imports'!AS41,'(3) Imports'!AT41))","v":""}]
{"$rows_left_out":41}