{"text_format":"1","workbook":"xlsx","n_sheets":6,"sheets":["(1)&(2)","(3)","FormData","RawData","Facility","AllProductData"],"not_rendered":{"charts":0,"images":1,"macros":1,"external_links":0,"defined_names":1,"comments":0,"pivot_tables":0},"unopened":[],"bounds":{"document_bytes":16777216,"sheet_cells":100000,"rows_first":2000,"rows_last":500,"rows_between":2000,"halvings":0,"cell_chars":16384,"cell_head_chars":4096},"cells_cut":0,"cells_raw":0,"read":"whole","date_system":"1900"}

{"sheet":"(1)&(2)","index":0,"n_rows":69,"n_cols":53,"rows_kept":69,"cut":false,"hidden":false,"merged":[[57,0,62,49],[67,2,67,11],[67,14,67,24],[67,26,67,29],[47,5,47,8],[47,16,47,17],[49,7,49,20],[51,12,51,13],[53,8,53,20],[51,17,51,18],[45,8,45,20],[38,8,38,20],[9,0,9,49],[16,6,16,20],[20,18,20,19],[18,18,18,19],[10,0,11,49],[12,0,13,24],[12,25,13,49],[18,27,20,48],[24,27,25,48],[31,27,32,48],[24,1,26,22],[36,8,36,20],[40,5,40,8],[40,16,40,17],[2,0,2,7],[5,44,5,49],[7,40,7,49],[8,0,8,49],[6,41,6,49]]}
[null,null,null,null,null,null,null,null,null,null,null,null,null,null,null,null,null,null,null,null,null,null,null,null,null,null,null,null,null,null,null,null,null,null,null,null,null,null,null,null,null,null,null,null,null,null,null,null,null,null,null,"Raw Data"]
[null,null,null,null,null,null,null,null,null,null,null,null,null,null,null,null,null,null,null,null,null,null,null,null,null,null,null,null,null,null,null,null,null,null,null,null,null,null,null,null,null,null,null,null,null,null,null,null,null,null,null,"Resubmission?",{"$f":"'(3)'!J27","v":"N"}]
[null,null,null,null,null,null,null,null,null,null,null,null,null,null,null,null,null,null,null,null,null,null,null,null,null,null,null,null,null,null,null,null,null,null,null,null,null,null,null,null,null,null,null,null,null,null,null,null,null,null,null,"Company Name",{"$f":"G17","v":0}]
[null,null,null,null,null,null,null,null,null,null,null,null,null,null,null,null,null,null,null,null,null,null,null,null,null,null,null,null,null,null,null,null,null,null,null,null,null,null,null,null,null,null,null,null,null,null,null,null,null,null,null,"Rpt Pd",{"$f":"M19","v":0}]
[null,null,null,null,null,null,null,null,null,null,null,null,null,null,null,null,null,null,null,null,null,null,null,null,null,null,null,null,null,null,null,null,null,null,null,null,null,null,null,null,null,null,null,null,null,null,null,null,null,null,null,"Rpt Date",{"$f":"CONCATENATE(K21,\"/\",O21,\"/\",S21)","v":"//"}]
[null,null,null,null,null,null,null,null,null,null,null,null,null,null,null,null,null,null,null,null,null,null,null,null,null,null,null,null,null,null,null,null,null,null,null,null,null,null,null,null,null,null,null,null,"Phone: (808) 587-3807",null,null,null,null,null,null,"ID No",{"$f":"#REF!","v":{"$error":"#REF!"}}]
[null,null,null,null,null,null,null,null,null,null,null,null,null,null,null,null,null,null,null,null,null,null,null,null,null,null,null,null,null,null,null,null,null,null,null,null,null,null,null,null,null,"Email: dbedt.hseo.eiirp@hawaii.gov",null,null,null,null,null,null,null,null,null,"Info changed?"]
[null,null,null,null,null,null,null,null,null,null,null,null,null,null,null,null,null,null,null,null,null,null,null,null,null,null,null,null,null,null,null,null,null,null,null,null,null,null,null,null,"https://energy.hawaii.gov/eiirp",null,null,null,null,null,null,null,null,null,null,"Distributor",false]
["Form DBEDT-301",null,null,null,null,null,null,null,null,null,null,null,null,null,null,null,null,null,null,null,null,null,null,null,null,null,null,null,null,null,null,null,null,null,null,null,null,null,null,null,null,null,null,null,null,null,null,null,null,null,null,"Refiner"]
["MONTHLY STORAGE FACILITY REPORT",null,null,null,null,null,null,null,null,null,null,null,null,null,null,null,null,null,null,null,null,null,null,null,null,null,null,null,null,null,null,null,null,null,null,null,null,null,null,null,null,null,null,null,null,null,null,null,null,null,null,"Facility Location",{"$f":"I37","v":0}]
["This Report is mandatory under chapter 486J, Hawaii Revised Statutes (\"HRS\").  Violations are subject to civil and criminal penalties pursuant to HRS § 486J-9 and other applicable laws or orders. CONFIDENTIAL PURSUANT TO APPLICABLE STATUTORY AUTHORITY (E.G., HRS § 486J-6) AND APPLICABLE PROTECTIVE ORDERS.",null,null,null,null,null,null,null,null,null,null,null,null,null,null,null,null,null,null,null,null,null,null,null,null,null,null,null,null,null,null,null,null,null,null,null,null,null,null,null,null,null,null,null,null,null,null,null,null,null,null,"Facility City",{"$f":"F41","v":" "}]
[null,null,null,null,null,null,null,null,null,null,null,null,null,null,null,null,null,null,null,null,null,null,null,null,null,null,null,null,null,null,null,null,null,null,null,null,null,null,null,null,null,null,null,null,null,null,null,null,null,null,null,"Facility State",{"$f":"M41","v":" "}]
["Part 1. Respondent Identification",null,null,null,null,null,null,null,null,null,null,null,null,null,null,null,null,null,null,null,null,null,null,null,null,"Part 2. Submission or Resubmission Information",null,null,null,null,null,null,null,null,null,null,null,null,null,null,null,null,null,null,null,null,null,null,null,null,null,"Facility Zip",{"$f":"Q41","v":" "}]
[null,null,null,null,null,null,null,null,null,null,null,null,null,null,null,null,null,null,null,null,null,null,null,null,null,null,null,null,null,null,null,null,null,null,null,null,null,null,null,null,null,null,null,null,null,null,null,null,null,null,null,"Mailing Add same?",false]
[null,null,null,null,null,null,null,null,null,null,null,null,null,null,null,null,null,null,null,null,null,null,null,null,null,null,null,null,null,null,null,null,null,null,null,null,null,null,null,null,null,null,null,null,null,null,null,null,null,null,null,"Mailing Add",{"$f":"I46","v":0}]
{"$rows_left_out":55}
{"sheet":"(3)","index":1,"n_rows":79,"n_cols":72,"rows_kept":79,"cut":false,"hidden":false,"merged":[[47,11,47,18],[52,11,52,18],[38,1,38,10],[39,1,39,10],[40,1,40,10],[41,1,41,10],[42,1,42,10],[39,11,39,18],[40,11,40,18],[41,11,41,18],[42,11,42,18],[44,1,44,10],[45,1,45,10],[46,1,46,10],[47,1,47,10],[52,1,52,10],[53,1,53,10],[54,1,54,10],[55,1,55,10],[31,11,31,18],[32,11,32,18],[36,11,36,18],[37,11,37,18],[38,11,38,18],[53,11,53,18],[54,11,54,18],[55,11,55,18],[33,1,33,10],[33,11,33,18],[51,1,51,10],[51,11,51,18],[31,1,31,10],[32,1,32,10],[36,1,36,10],[37,1,37,10],[43,1,43,10],[43,11,43,18],[44,11,44,18],[45,11,45,18],[46,11,46,18],[70,54,70,58],[29,29,30,33],[30,34,30,38],[30,39,30,43],[30,44,30,48],[30,49,30,53],[29,34,29,53],[68,44,68,48],[68,49,68,53],[68,54,68,58],[69,44,69,48],[69,49,69,53],[69,54,69,58],[66,44,66,48],[66,49,66,53],[45,44,45,48],[45,49,45,53],[45,54,45,58],[46,44,46,48],[59,39,59,43],[70,34,70,38],[31,39,31,43],[32,39,32,43],[33,39,33,43],[31,64,31,68],[32,64,32,68],[33,64,33,68],[34,64,34,68],[35,64,35,68],[50,59,50,63],[38,64,38,68],[37,44,37,48],[37,49,37,53],[37,54,37,58],[38,44,38,48],[38,49,38,53],[38,54,38,58],[35,44,35,48],[35,49,35,53],[35,54,35,58],[36,44,36,48],[36,49,36,53],[36,54,36,58],[46,49,46,53],[46,54,46,58],[39,44,39,48],[39,49,39,53],[39,54,39,58],[50,64,50,68],[37,64,37,68],[34,49,34,53],[34,54,34,58],[47,49,47,53],[47,54,47,58],[49,49,49,53],[49,54,49,58],[50,49,50,53],[50,54,50,58],[48,49,48,53],[48,54,48,58],[40,49,40,53],[40,54,40,58],[44,59,44,63],[45,59,45,63],[46,59,46,63],[47,59,47,63],[48,59,48,63],[49,59,49,63],[38,59,38,63],[39,59,39,63],[40,59,40,63],[41,59,41,63],[66,64,66,68],[60,64,60,68],[61,64,61,68],[62,64,62,68],[64,64,64,68],[51,44,51,48],[51,49,51,53],[51,54,51,58],[52,44,52,48],[52,49,52,53],[52,54,52,58],[51,59,51,63],[52,59,52,63],[66,54,66,58],[55,49,55,53],[55,54,55,58],[56,49,56,53],[56,54,56,58],[53,49,53,53],[53,54,53,58],[54,49,54,53],[54,54,54,58],[66,59,66,63],[63,64,63,68],[62,39,62,43],[64,39,64,43],[60,34,60,38],[63,34,63,38],[63,39,63,43],[63,44,63,48],[63,49,63,53],[63,54,63,58],[63,59,63,63],[67,59,67,63],[55,59,55,63],[56,59,56,63],[57,59,57,63],[58,59,58,63],[59,59,59,63],[60,59,60,63],[61,59,61,63],[62,59,62,63],[64,59,64,63],[31,69,31,73],[32,69,32,73],[32,44,32,48],[32,49,32,53],[39,34,39,38],[40,34,40,38],[41,34,41,38],[42,34,42,38],[43,34,43,38],[31,34,31,38],[32,34,32,38],[33,34,33,38],[34,34,34,38],[35,34,35,38],[36,34,36,38],[37,34,37,38],[38,34,38,38],[39,39,39,43],[40,39,40,43],[33,59,33,63],[34,59,34,63],[35,59,35,63],[42,39,42,43],[43,39,43,43],[31,59,31,63],[32,59,32,63],[32,29,32,33],[31,29,31,33],[31,44,31,48],[31,49,31,53],[31,54,31,58],[32,54,32,58],[61,34,61,38],[51,34,51,38],[50,44,50,48],[40,44,40,48],[60,39,60,43],[61,39,61,43],[50,39,50,43],[51,39,51,43],[50,34,50,38],[41,29,41,33],[42,44,42,48],[42,49,42,53],[42,54,42,58],[43,54,43,58],[46,29,46,33],[47,29,47,33],[21,9,21,19],[22,9,22,19],[18,9,18,19],[19,9,19,19],[20,9,20,19],[16,0,16,8],[17,0,17,8],[28,69,28,73],[18,0,18,8],[19,0,19,8],[20,0,20,8],[21,0,21,8],[22,0,22,8],[29,54,29,73],[29,0,30,0],[29,1,30,10],[29,11,30,18],[30,54,30,58],[30,59,30,63],[30,64,30,68],[30,69,30,73],[23,9,23,19],[24,9,24,19],[25,9,25,19],[26,9,26,19],[26,0,26,8],[23,0,23,8],[24,0,24,8],[25,0,25,8],[0,0,1,73],[4,0,4,6],[10,0,10,73],[15,13,15,14],[11,0,11,73],[13,0,13,73],[15,11,15,12],[16,9,16,19],[17,9,17,19],[36,69,36,73],[36,29,36,33],[34,69,34,73],[33,69,33,73],[33,29,33,33],[36,64,36,68],[35,1,35,10],[35,11,35,18],[35,29,35,33],[35,69,35,73],[34,1,34,10],[34,11,34,18],[34,29,34,33],[33,44,33,48],[33,49,33,53],[33,54,33,58],[34,44,34,48],[34,39,34,43],[35,39,35,43],[36,39,36,43],[36,59,36,63],[41,64,41,68],[40,69,40,73],[40,29,40,33],[37,39,37,43],[41,39,41,43],[37,59,37,63],[41,44,41,48],[41,49,41,53],[41,54,41,58],[38,69,38,73],[37,69,37,73],[39,69,39,73],[38,29,38,33],[39,29,39,33],[37,29,37,33],[38,39,38,43],[39,64,39,68],[40,64,40,68],[42,69,42,73],[41,69,41,73],[42,64,42,68],[42,59,42,63],[42,24,42,28],[43,19,43,23],[43,24,43,28],[44,19,44,23],[43,69,43,73],[42,29,42,33],[43,59,43,63],[44,24,44,28],[43,29,43,33],[44,69,44,73],[44,29,44,33],[44,34,44,38],[44,39,44,43],[44,64,44,68],[44,44,44,48],[44,49,44,53],[44,54,44,58],[43,64,43,68],[43,44,43,48],[43,49,43,53],[45,29,45,33],[45,39,45,43],[46,39,46,43],[47,39,47,43],[47,44,47,48],[45,34,45,38],[45,64,45,68],[46,64,46,68],[47,64,47,68],[46,69,46,73],[46,34,46,38],[47,34,47,38],[48,34,48,38],[49,34,49,38],[49,64,49,68],[48,44,48,48],[48,64,48,68],[45,69,45,73],[47,69,47,73],[51,29,51,33],[48,1,48,10],[48,11,48,18],[51,69,51,73],[50,1,50,10],[50,11,50,18],[50,29,50,33],[49,1,49,10],[49,11,49,18],[48,39,48,43],[49,39,49,43],[51,64,51,68],[49,44,49,48],[50,69,50,73],[49,19,49,23],[49,24,49,28],[50,19,50,23],[50,24,50,28],[51,19,51,23],[51,24,51,28],[49,69,49,73],[49,29,49,33],[48,69,48,73],[48,29,48,33],[54,19,54,23],[54,24,54,28],[55,19,55,23],[55,24,55,28],[55,34,55,38],[52,69,52,73],[52,29,52,33],[52,64,52,68],[54,69,54,73],[53,69,53,73],[53,29,53,33],[53,64,53,68],[53,44,53,48],[54,44,54,48],[52,39,52,43],[53,59,53,63],[54,59,54,63],[52,34,52,38],[53,34,53,38],[54,34,54,38],[53,39,53,43],[57,69,57,73],[56,34,56,38],[55,69,55,73],[54,29,54,33],[55,29,55,33],[54,39,54,43],[55,39,55,43],[54,64,54,68],[55,64,55,68],[55,44,55,48],[57,34,57,38],[58,34,58,38],[56,1,56,10],[56,11,56,18],[59,69,59,73],[58,1,58,10],[58,11,58,18],[58,29,58,33],[57,1,57,10],[57,11,57,18],[56,39,56,43],[57,39,57,43],[58,39,58,43],[57,64,57,68],[58,64,58,68],[59,64,59,68],[59,44,59,48],[59,49,59,53],[59,54,59,58],[57,44,57,48],[57,49,57,53],[57,54,57,58],[58,44,58,48],[58,69,58,73],[59,1,59,10],[59,11,59,18],[59,29,59,33],[61,69,61,73],[60,1,60,10],[60,11,60,18],[60,69,60,73],[60,29,60,33],[60,44,60,48],[60,49,60,53],[60,54,60,58],[61,44,61,48],[61,49,61,53],[61,54,61,58],[61,1,61,10],[61,11,61,18],[59,19,59,23],[59,24,59,28],[60,19,60,23],[60,24,60,28],[59,34,59,38],[64,1,64,10],[64,11,64,18],[64,29,64,33],[61,29,61,33],[62,69,62,73],[64,69,64,73],[62,1,62,10],[62,11,62,18],[62,29,62,33],[64,44,64,48],[64,49,64,53],[64,54,64,58],[62,44,62,48],[62,49,62,53],[62,54,62,58],[64,34,64,38],[62,34,62,38],[62,19,62,23],[62,24,62,28],[63,1,63,10],[63,11,63,18],[63,19,63,23],[63,24,63,28],[63,29,63,33],[66,11,66,18],[33,19,33,23],[33,24,33,28],[34,19,34,23],[34,24,34,28],[35,19,35,23],[35,24,35,28],[36,19,36,23],[36,24,36,28],[37,19,37,23],[37,24,37,28],[38,19,38,23],[38,24,38,28],[39,19,39,23],[39,24,39,28],[40,19,40,23],[52,19,52,23],[52,24,52,28],[53,19,53,23],[53,24,53,28],[40,24,40,28],[41,19,41,23],[41,24,41,28],[42,19,42,23],[70,11,70,18],[70,29,70,33],[69,1,69,10],[7,68,7,73],[8,65,8,73],[9,63,9,73],[66,69,66,73],[66,29,66,33],[67,69,67,73],[67,39,67,43],[68,39,68,43],[67,34,67,38],[68,34,68,38],[66,34,66,38],[29,19,30,23],[29,24,30,28],[31,19,31,23],[31,24,31,28],[32,19,32,23],[32,24,32,28],[67,1,67,10],[67,11,67,18],[68,29,68,33],[66,1,66,10],[70,69,70,73],[70,1,70,10],[67,29,67,33],[68,69,68,73],[73,45,73,49],[69,69,69,73],[69,11,69,18],[69,29,69,33],[69,39,69,43],[70,39,70,43],[69,59,69,63],[70,59,70,63],[67,64,67,68],[68,64,68,68],[69,64,69,68],[70,64,70,68],[70,19,70,23],[70,24,70,28],[68,1,68,10],[68,11,68,18],[68,59,68,63],[67,44,67,48],[67,49,67,53],[67,54,67,58],[77,45,77,49],[64,19,64,23],[64,24,64,28],[66,19,66,23],[66,24,66,28],[67,19,67,23],[67,24,67,28],[68,19,68,23],[68,24,68,28],[69,19,69,23],[69,24,69,28],[75,45,75,49],[70,44,70,48],[70,49,70,53],[69,34,69,38],[66,39,66,43],[63,69,63,73],[45,19,45,23],[45,24,45,28],[46,19,46,23],[46,24,46,28],[47,19,47,23],[47,24,47,28],[48,19,48,23],[48,24,48,28],[61,19,61,23],[61,24,61,28],[57,29,57,33],[56,69,56,73],[56,29,56,33],[58,49,58,53],[58,54,58,58],[56,64,56,68],[56,44,56,48],[56,19,56,23],[56,24,56,28],[57,19,57,23],[57,24,57,28],[58,19,58,23],[58,24,58,28]]}
["Part 3. Storage Facility Detail"]
[]
[]
[]
[]
[]
[]
[null,null,null,null,null,null,null,null,null,null,null,null,null,null,null,null,null,null,null,null,null,null,null,null,null,null,null,null,null,null,null,null,null,null,null,null,null,null,null,null,null,null,null,null,null,null,null,null,null,null,null,null,null,null,null,null,null,null,null,null,null,null,null,null,null,null,null,null,"Phone: (808) 587-3807"]
[null,null,null,null,null,null,null,null,null,null,null,null,null,null,null,null,null,null,null,null,null,null,null,null,null,null,null,null,null,null,null,null,null,null,null,null,null,null,null,null,null,null,null,null,null,null,null,null,null,null,null,null,null,null,null,null,null,null,null,null,null,null,null,null,null,"Email: dbedt.hseo.eiirp@hawaii.gov"]
[null,null,null,null,null,null,null,null,null,null,null,null,null,null,null,null,null,null,null,null,null,null,null,null,null,null,null,null,null,null,null,null,null,null,null,null,null,null,null,null,null,null,null,null,null,null,null,null,null,null,null,null,null,null,null,null,null,null,null,null,null,null,null,"https://energy.hawaii.gov/eiirp"]
["Form DBEDT-301"]
["MONTHLY STORAGE FACILITY REPORT"]
[]
["This Report is mandatory under chapter 486J, Hawaii Revised Statutes (\"HRS\").  Violations are subject to civil and criminal penalties pursuant to HRS § 486J-9 and other applicable laws or orders. CONFIDENTIAL PURSUANT TO APPLICABLE STATUTORY AUTHORITY (E.G., HRS § 486J-6) AND APPLICABLE PROTECTIVE ORDERS."]
[]
{"$rows_left_out":65}
{"sheet":"FormData","index":2,"n_rows":2,"n_cols":16,"rows_kept":2,"cut":false,"hidden":true,"merged":[]}
["form_code","dbedt","company_code","asset_id","facility_code","island_code","report_date","report_period","report_period_month","report_period_year","resubmission","total_products_reported","total_barrels_reported","total_receipts","total_distribution","total_inventory"]
[{"$f":"'(3)'!J20","v":""},301,{"$f":"'(3)'!J19","v":""},{"$f":"_xlfn.IFNA(VLOOKUP('(3)'!J21,Facility!$A$2:$H$35,7, FALSE), \"\" )","v":""},{"$f":"_xlfn.IFNA(VLOOKUP('(3)'!J21,Facility!$A$2:$H$35,8, FALSE), \"\" )","v":""},{"$f":"'(3)'!J23","v":""},{"$f":"'(3)'!J24","v":"//"},{"$f":"'(3)'!J26","v":""},{"$f":"'(1)&(2)'!O19","v":0},{"$f":"'(1)&(2)'!S19","v":0},{"$f":"Facility!B74","v":false},null,null,{"$f":"'(3)'!AT74","v":" "},{"$f":"'(3)'!AT76","v":0},{"$f":"'(3)'!AT78","v":" "}]

{"sheet":"RawData","index":3,"n_rows":2,"n_cols":14,"rows_kept":2,"cut":false,"hidden":true,"merged":[]}
["form_code","product","product_code","maximum_capacity","net_capacity","end_month_inventory","receipts_pipeline","receipts_tanker","receipts_barge","receipts_truck","distribution_pipeline","distribution_tanker","distribution_barge","distribution_truck"]
[{"$f":"_xlfn._xlws.SORT(_xlfn.UNIQUE(AllProductData!A2:N38,FALSE,FALSE),1,-1,FALSE)","v":""},"","","","","","","","","","","","",""]

{"sheet":"Facility","index":4,"n_rows":74,"n_cols":8,"rows_kept":74,"cut":false,"hidden":true,"merged":[]}
["Facility Name","Facility Street Address","City","State","Zip","Island","Facility Code","Code"]
["Aloha Hilo Terminal","999 Kalanianaole Avenue","Hilo","HI","96720","Hawaii","TM_013","001"]
["Aloha Hilo Terminal 2","661 Kalanianaole Avenue","Hilo","HI","96720","Hawaii","TM_014","002"]
["Aloha Honolulu Terminal","789 North Nimitz Highway","Honolulu","HI","96817","O'ahu","TM_006","003"]
["Aloha Kahului Terminal","60 Hobron Avenue","Kahului","HI","96732","Maui","TM_015","004"]
["Aloha Nawiliwili Terminal","3145 Waapa Road","Lihue","HI","96766","Kaua'i","TM_016","005"]
["Aloha TFM Kalaeloa Terminal","91-119 Hanua Street","Kapolei","HI","96707","O'ahu","TM_010","006"]
["Hawaii Gas Barbers Point","91-571 Malakole St ","Kapolei","HI","96707","O'ahu","TM_011","007"]
["Hawaii Gas Hilo Base Yard","945 Kalanianaole Ave","Hilo","HI","96720","Hawaii","TM_017","008"]
["Hawaii Gas Kauai Base Yard","3000 Waapa Road","Lihue","HI","96766","Kaua'i","TM_018","009"]
["Hawaii Gas Kona","74-5564 Kaiwi Street","Kailua","HI","96740","Hawaii","TM_019","010"]
["Hawaii Gas Lanai","9th Street","Lanai City","HI","96763","Lana'i","TM_020","011"]
["Hawaii Gas Maui Base Yard","20 Hobron Avenue","Kahului","HI","96732","Maui","TM_021","012"]
["Hawaii Gas Molokai","Ulili Street","Kaunakakai","HI","96748","Moloka'i","TM_022","013"]
["Hawaii Petroleum Kona Cardlock","74-5558 B Kaiwi Street","Kailua-Kona","HI","96740","Hawaii","TM_023","014"]
{"$rows_left_out":60}
{"sheet":"AllProductData","index":5,"n_rows":39,"n_cols":14,"rows_kept":39,"cut":false,"hidden":true,"merged":[]}
["form_code","product","product_code","maximum_capacity","net_capacity","end_month_inventory","receipts_pipeline","receipts_tanker","receipts_barge","receipts_truck","distribution_pipeline","distribution_tanker","distribution_barge","distribution_truck"]
[{"$f":"IF(B2=\"\",\"\",'(3)'!$J$20)","v":""},{"$f":"IF(SUM('(3)'!T32:BV32)=0,\"\",('(3)'!B32 & \"\"))","v":""},{"$f":"IF(B2=\"\",\"\",('(3)'!L32 & \"\"))","v":""},{"$f":"'(3)'!T32 & \"\"","v":""},{"$f":"'(3)'!Y32 & \"\"","v":""},{"$f":"'(3)'!AD32 & \"\"","v":""},{"$f":"'(3)'!AI32 & \"\"","v":""},{"$f":"'(3)'!AN32 & \"\"","v":""},{"$f":"'(3)'!AS32 & \"\"","v":""},{"$f":"'(3)'!AX32 & \"\"","v":""},{"$f":"'(3)'!BC32 & \"\"","v":""},{"$f":"'(3)'!BH32 & \"\"","v":""},{"$f":"'(3)'!BM32 & \"\"","v":""},{"$f":"'(3)'!BR32 & \"\"","v":""}]
[{"$f":"IF(B3=\"\",\"\",'(3)'!$J$20)","v":""},{"$f":"IF(SUM('(3)'!T33:BV33)=0,\"\",('(3)'!B33 & \"\"))","v":""},{"$f":"IF(B3=\"\",\"\",('(3)'!L33 & \"\"))","v":""},{"$f":"'(3)'!T33 & \"\"","v":""},{"$f":"'(3)'!Y33 & \"\"","v":""},{"$f":"'(3)'!AD33 & \"\"","v":""},{"$f":"'(3)'!AI33 & \"\"","v":""},{"$f":"'(3)'!AN33 & \"\"","v":""},{"$f":"'(3)'!AS33 & \"\"","v":""},{"$f":"'(3)'!AX33 & \"\"","v":""},{"$f":"'(3)'!BC33 & \"\"","v":""},{"$f":"'(3)'!BH33 & \"\"","v":""},{"$f":"'(3)'!BM33 & \"\"","v":""},{"$f":"'(3)'!BR33 & \"\"","v":""}]
[{"$f":"IF(B4=\"\",\"\",'(3)'!$J$20)","v":""},{"$f":"IF(SUM('(3)'!T34:BV34)=0,\"\",('(3)'!B34 & \"\"))","v":""},{"$f":"IF(B4=\"\",\"\",('(3)'!L34 & \"\"))","v":""},{"$f":"'(3)'!T34 & \"\"","v":""},{"$f":"'(3)'!Y34 & \"\"","v":""},{"$f":"'(3)'!AD34 & \"\"","v":""},{"$f":"'(3)'!AI34 & \"\"","v":""},{"$f":"'(3)'!AN34 & \"\"","v":""},{"$f":"'(3)'!AS34 & \"\"","v":""},{"$f":"'(3)'!AX34 & \"\"","v":""},{"$f":"'(3)'!BC34 & \"\"","v":""},{"$f":"'(3)'!BH34 & \"\"","v":""},{"$f":"'(3)'!BM34 & \"\"","v":""},{"$f":"'(3)'!BR34 & \"\"","v":""}]
[{"$f":"IF(B5=\"\",\"\",'(3)'!$J$20)","v":""},{"$f":"IF(SUM('(3)'!T35:BV35)=0,\"\",('(3)'!B35 & \"\"))","v":""},{"$f":"IF(B5=\"\",\"\",('(3)'!L35 & \"\"))","v":""},{"$f":"'(3)'!T35 & \"\"","v":""},{"$f":"'(3)'!Y35 & \"\"","v":""},{"$f":"'(3)'!AD35 & \"\"","v":""},{"$f":"'(3)'!AI35 & \"\"","v":""},{"$f":"'(3)'!AN35 & \"\"","v":""},{"$f":"'(3)'!AS35 & \"\"","v":""},{"$f":"'(3)'!AX35 & \"\"","v":""},{"$f":"'(3)'!BC35 & \"\"","v":""},{"$f":"'(3)'!BH35 & \"\"","v":""},{"$f":"'(3)'!BM35 & \"\"","v":""},{"$f":"'(3)'!BR35 & \"\"","v":""}]
[{"$f":"IF(B6=\"\",\"\",'(3)'!$J$20)","v":""},{"$f":"IF(SUM('(3)'!T36:BV36)=0,\"\",('(3)'!B36 & \"\"))","v":""},{"$f":"IF(B6=\"\",\"\",('(3)'!L36 & \"\"))","v":""},{"$f":"'(3)'!T36 & \"\"","v":""},{"$f":"'(3)'!Y36 & \"\"","v":""},{"$f":"'(3)'!AD36 & \"\"","v":""},{"$f":"'(3)'!AI36 & \"\"","v":""},{"$f":"'(3)'!AN36 & \"\"","v":""},{"$f":"'(3)'!AS36 & \"\"","v":""},{"$f":"'(3)'!AX36 & \"\"","v":""},{"$f":"'(3)'!BC36 & \"\"","v":""},{"$f":"'(3)'!BH36 & \"\"","v":""},{"$f":"'(3)'!BM36 & \"\"","v":""},{"$f":"'(3)'!BR36 & \"\"","v":""}]
[{"$f":"IF(B7=\"\",\"\",'(3)'!$J$20)","v":""},{"$f":"IF(SUM('(3)'!T37:BV37)=0,\"\",('(3)'!B37 & \"\"))","v":""},{"$f":"IF(B7=\"\",\"\",('(3)'!L37 & \"\"))","v":""},{"$f":"'(3)'!T37 & \"\"","v":""},{"$f":"'(3)'!Y37 & \"\"","v":""},{"$f":"'(3)'!AD37 & \"\"","v":""},{"$f":"'(3)'!AI37 & \"\"","v":""},{"$f":"'(3)'!AN37 & \"\"","v":""},{"$f":"'(3)'!AS37 & \"\"","v":""},{"$f":"'(3)'!AX37 & \"\"","v":""},{"$f":"'(3)'!BC37 & \"\"","v":""},{"$f":"'(3)'!BH37 & \"\"","v":""},{"$f":"'(3)'!BM37 & \"\"","v":""},{"$f":"'(3)'!BR37 & \"\"","v":""}]
[{"$f":"IF(B8=\"\",\"\",'(3)'!$J$20)","v":""},{"$f":"IF(SUM('(3)'!T38:BV38)=0,\"\",('(3)'!B38 & \"\"))","v":""},{"$f":"IF(B8=\"\",\"\",('(3)'!L38 & \"\"))","v":""},{"$f":"'(3)'!T38 & \"\"","v":""},{"$f":"'(3)'!Y38 & \"\"","v":""},{"$f":"'(3)'!AD38 & \"\"","v":""},{"$f":"'(3)'!AI38 & \"\"","v":""},{"$f":"'(3)'!AN38 & \"\"","v":""},{"$f":"'(3)'!AS38 & \"\"","v":""},{"$f":"'(3)'!AX38 & \"\"","v":""},{"$f":"'(3)'!BC38 & \"\"","v":""},{"$f":"'(3)'!BH38 & \"\"","v":""},{"$f":"'(3)'!BM38 & \"\"","v":""},{"$f":"'(3)'!BR38 & \"\"","v":""}]
[{"$f":"IF(B9=\"\",\"\",'(3)'!$J$20)","v":""},{"$f":"IF(SUM('(3)'!T39:BV39)=0,\"\",('(3)'!B39 & \"\"))","v":""},{"$f":"IF(B9=\"\",\"\",('(3)'!L39 & \"\"))","v":""},{"$f":"'(3)'!T39 & \"\"","v":""},{"$f":"'(3)'!Y39 & \"\"","v":""},{"$f":"'(3)'!AD39 & \"\"","v":""},{"$f":"'(3)'!AI39 & \"\"","v":""},{"$f":"'(3)'!AN39 & \"\"","v":""},{"$f":"'(3)'!AS39 & \"\"","v":""},{"$f":"'(3)'!AX39 & \"\"","v":""},{"$f":"'(3)'!BC39 & \"\"","v":""},{"$f":"'(3)'!BH39 & \"\"","v":""},{"$f":"'(3)'!BM39 & \"\"","v":""},{"$f":"'(3)'!BR39 & \"\"","v":""}]
[{"$f":"IF(B10=\"\",\"\",'(3)'!$J$20)","v":""},{"$f":"IF(SUM('(3)'!T40:BV40)=0,\"\",('(3)'!B40 & \"\"))","v":""},{"$f":"IF(B10=\"\",\"\",('(3)'!L40 & \"\"))","v":""},{"$f":"'(3)'!T40 & \"\"","v":""},{"$f":"'(3)'!Y40 & \"\"","v":""},{"$f":"'(3)'!AD40 & \"\"","v":""},{"$f":"'(3)'!AI40 & \"\"","v":""},{"$f":"'(3)'!AN40 & \"\"","v":""},{"$f":"'(3)'!AS40 & \"\"","v":""},{"$f":"'(3)'!AX40 & \"\"","v":""},{"$f":"'(3)'!BC40 & \"\"","v":""},{"$f":"'(3)'!BH40 & \"\"","v":""},{"$f":"'(3)'!BM40 & \"\"","v":""},{"$f":"'(3)'!BR40 & \"\"","v":""}]
[{"$f":"IF(B11=\"\",\"\",'(3)'!$J$20)","v":""},{"$f":"IF(SUM('(3)'!T41:BV41)=0,\"\",('(3)'!B41 & \"\"))","v":""},{"$f":"IF(B11=\"\",\"\",('(3)'!L41 & \"\"))","v":""},{"$f":"'(3)'!T41 & \"\"","v":""},{"$f":"'(3)'!Y41 & \"\"","v":""},{"$f":"'(3)'!AD41 & \"\"","v":""},{"$f":"'(3)'!AI41 & \"\"","v":""},{"$f":"'(3)'!AN41 & \"\"","v":""},{"$f":"'(3)'!AS41 & \"\"","v":""},{"$f":"'(3)'!AX41 & \"\"","v":""},{"$f":"'(3)'!BC41 & \"\"","v":""},{"$f":"'(3)'!BH41 & \"\"","v":""},{"$f":"'(3)'!BM41 & \"\"","v":""},{"$f":"'(3)'!BR41 & \"\"","v":""}]
[{"$f":"IF(B12=\"\",\"\",'(3)'!$J$20)","v":""},{"$f":"IF(SUM('(3)'!T42:BV42)=0,\"\",('(3)'!B42 & \"\"))","v":""},{"$f":"IF(B12=\"\",\"\",('(3)'!L42 & \"\"))","v":""},{"$f":"'(3)'!T42 & \"\"","v":""},{"$f":"'(3)'!Y42 & \"\"","v":""},{"$f":"'(3)'!AD42 & \"\"","v":""},{"$f":"'(3)'!AI42 & \"\"","v":""},{"$f":"'(3)'!AN42 & \"\"","v":""},{"$f":"'(3)'!AS42 & \"\"","v":""},{"$f":"'(3)'!AX42 & \"\"","v":""},{"$f":"'(3)'!BC42 & \"\"","v":""},{"$f":"'(3)'!BH42 & \"\"","v":""},{"$f":"'(3)'!BM42 & \"\"","v":""},{"$f":"'(3)'!BR42 & \"\"","v":""}]
[{"$f":"IF(B13=\"\",\"\",'(3)'!$J$20)","v":""},{"$f":"IF(SUM('(3)'!T43:BV43)=0,\"\",('(3)'!B43 & \"\"))","v":""},{"$f":"IF(B13=\"\",\"\",('(3)'!L43 & \"\"))","v":""},{"$f":"'(3)'!T43 & \"\"","v":""},{"$f":"'(3)'!Y43 & \"\"","v":""},{"$f":"'(3)'!AD43 & \"\"","v":""},{"$f":"'(3)'!AI43 & \"\"","v":""},{"$f":"'(3)'!AN43 & \"\"","v":""},{"$f":"'(3)'!AS43 & \"\"","v":""},{"$f":"'(3)'!AX43 & \"\"","v":""},{"$f":"'(3)'!BC43 & \"\"","v":""},{"$f":"'(3)'!BH43 & \"\"","v":""},{"$f":"'(3)'!BM43 & \"\"","v":""},{"$f":"'(3)'!BR43 & \"\"","v":""}]
[{"$f":"IF(B14=\"\",\"\",'(3)'!$J$20)","v":""},{"$f":"IF(SUM('(3)'!T44:BV44)=0,\"\",('(3)'!B44 & \"\"))","v":""},{"$f":"IF(B14=\"\",\"\",('(3)'!L44 & \"\"))","v":""},{"$f":"'(3)'!T44 & \"\"","v":""},{"$f":"'(3)'!Y44 & \"\"","v":""},{"$f":"'(3)'!AD44 & \"\"","v":""},{"$f":"'(3)'!AI44 & \"\"","v":""},{"$f":"'(3)'!AN44 & \"\"","v":""},{"$f":"'(3)'!AS44 & \"\"","v":""},{"$f":"'(3)'!AX44 & \"\"","v":""},{"$f":"'(3)'!BC44 & \"\"","v":""},{"$f":"'(3)'!BH44 & \"\"","v":""},{"$f":"'(3)'!BM44 & \"\"","v":""},{"$f":"'(3)'!BR44 & \"\"","v":""}]
[{"$f":"IF(B15=\"\",\"\",'(3)'!$J$20)","v":""},{"$f":"IF(SUM('(3)'!T45:BV45)=0,\"\",('(3)'!B45 & \"\"))","v":""},{"$f":"IF(B15=\"\",\"\",('(3)'!L45 & \"\"))","v":""},{"$f":"'(3)'!T45 & \"\"","v":""},{"$f":"'(3)'!Y45 & \"\"","v":""},{"$f":"'(3)'!AD45 & \"\"","v":""},{"$f":"'(3)'!AI45 & \"\"","v":""},{"$f":"'(3)'!AN45 & \"\"","v":""},{"$f":"'(3)'!AS45 & \"\"","v":""},{"$f":"'(3)'!AX45 & \"\"","v":""},{"$f":"'(3)'!BC45 & \"\"","v":""},{"$f":"'(3)'!BH45 & \"\"","v":""},{"$f":"'(3)'!BM45 & \"\"","v":""},{"$f":"'(3)'!BR45 & \"\"","v":""}]
{"$rows_left_out":24}